Reaction Details
TargetSerine/threonine-protein kinase mTOR
LigandBDBM50387586
Substrate/Competitorn/a
Meas. Tech.ChEMBL_830504 (CHEMBL2061274)
Ki 23.5±n/a nM
Citation Le, PTCheng, HNinkovic, SPlewe, MHuang, XWang, HBagrodia, SSun, SKnighton, DRLaFleur Rogers, CMPannifer, AGreasley, SDalvie, DZhang, E Design and synthesis of a novel pyrrolidinyl pyrido pyrimidinone derivative as a potent inhibitor of PI3Ka and mTOR. Bioorg Med Chem Lett22:5098-103 (2012) 
 
Serine/threonine-protein kinase mTOR
Name:Serine/threonine-protein kinase mTOR
Type:Rapamycin target protein
Mol. Mass.:288917.12
Organism:Homo sapiens (Human)
Description:P42345
Residue:2549
BDBM50387586
NameBDBM50387586
Synonyms:CHEMBL2057731 | US8633204, 208
TypeSmall organic molecule
Emp. Form.C14H16N6O
Mol. Mass.284.3164
SMILESCC(C)n1c2nc(N)nc(C)c2cc(-c2cn[nH]c2)c1=O