Reaction Details
TargetSerine/threonine-protein kinase mTOR
LigandBDBM50387589
Substrate/Competitorn/a
Meas. Tech.ChEMBL_830504 (CHEMBL2061274)
Ki 76.4±n/a nM
Citation Le, PTCheng, HNinkovic, SPlewe, MHuang, XWang, HBagrodia, SSun, SKnighton, DRLaFleur Rogers, CMPannifer, AGreasley, SDalvie, DZhang, E Design and synthesis of a novel pyrrolidinyl pyrido pyrimidinone derivative as a potent inhibitor of PI3Ka and mTOR. Bioorg Med Chem Lett22:5098-103 (2012) 
 
Serine/threonine-protein kinase mTOR
Name:Serine/threonine-protein kinase mTOR
Type:Rapamycin target protein
Mol. Mass.:288917.12
Organism:Homo sapiens (Human)
Description:P42345
Residue:2549
BDBM50387589
NameBDBM50387589
Synonyms:CHEMBL2057727 | US8633204, 206
TypeSmall organic molecule
Emp. Form.C18H19N5O2
Mol. Mass.337.3758
SMILESCOc1ccc(cn1)-c1cc2c(C)nc(N)nc2n(C2CCC2)c1=O