Reaction Details
TargetSerine/threonine-protein kinase mTOR
LigandBDBM50387590
Substrate/Competitorn/a
Meas. Tech.ChEMBL_830504 (CHEMBL2061274)
Ki 142±n/a nM
Citation Le, PTCheng, HNinkovic, SPlewe, MHuang, XWang, HBagrodia, SSun, SKnighton, DRLaFleur Rogers, CMPannifer, AGreasley, SDalvie, DZhang, E Design and synthesis of a novel pyrrolidinyl pyrido pyrimidinone derivative as a potent inhibitor of PI3Ka and mTOR. Bioorg Med Chem Lett22:5098-103 (2012) 
 
Serine/threonine-protein kinase mTOR
Name:Serine/threonine-protein kinase mTOR
Type:Rapamycin target protein
Mol. Mass.:288917.12
Organism:Homo sapiens (Human)
Description:P42345
Residue:2549
BDBM50387590
NameBDBM50387590
Synonyms:CHEMBL2057725 | US8633204, 111
TypeSmall organic molecule
Emp. Form.C19H21N5O2
Mol. Mass.351.4023
SMILESCOc1ccc(cn1)-c1cc2c(C)nc(N)nc2n(C2CCCC2)c1=O