Reaction Details
TargetPhosphatidylinositol 4,5-bisphosphate 3-kinase catalytic subunit alpha isoform
LigandBDBM50387585
Substrate/Competitorn/a
Meas. Tech.ChEMBL_830503 (CHEMBL2061273)
Ki 138±n/a nM
Citation Le, PTCheng, HNinkovic, SPlewe, MHuang, XWang, HBagrodia, SSun, SKnighton, DRLaFleur Rogers, CMPannifer, AGreasley, SDalvie, DZhang, E Design and synthesis of a novel pyrrolidinyl pyrido pyrimidinone derivative as a potent inhibitor of PI3Ka and mTOR. Bioorg Med Chem Lett22:5098-103 (2012) 
 
Phosphatidylinositol 4,5-bisphosphate 3-kinase catalytic subunit alpha isoform
Name:Phosphatidylinositol 4,5-bisphosphate 3-kinase catalytic subunit alpha isoform
Type:Protein
Mol. Mass.:124421.84
Organism:Mus musculus (Mouse)
Description:P42337
Residue:1068
BDBM50387585
NameBDBM50387585
Synonyms:CHEMBL2057732
TypeSmall organic molecule
Emp. Form.C15H19N7O
Mol. Mass.313.3577
SMILESCCN(CC)n1c2nc(N)nc(C)c2cc(-c2cn[nH]c2)c1=O