Reaction Details
TargetCorticotropin-releasing factor receptor 1
LigandBDBM50387634
Substrate/Competitorn/a
Meas. Tech.ChEMBL_830642 (CHEMBL2061535)
IC50 4.5±n/a nM
Citation Dzierba, CDSielecki, TMArvanitis, AGGalka, AJohnson, TLTakvorian, AGRafalski, MKasireddy-Polam, PVig, SDasgupta, BZhang, GMolski, TFWong, HZaczek, RCLodge, NJCombs, APGilligan, PJTrainor, GLBronson, JJMacor, JE Synthesis and structure-activity relationships of pyrido[3,2-b]pyrazin-3(4H)-ones and pteridin-7(8H)-ones as corticotropin-releasing factor-1 receptor antagonists. Bioorg Med Chem Lett22:4986-9 (2012) 
 
Corticotropin-releasing factor receptor 1
Name:Corticotropin-releasing factor receptor 1
Type:G Protein-Coupled Receptor (GPCR)
Mol. Mass.:47870.75
Organism:Rattus norvegicus (rat)
Description:Receptor binding assays were performed using rat cortex homogenate.
Residue:415
BDBM50387634
NameBDBM50387634
Synonyms:CHEMBL2058337
TypeSmall organic molecule
Emp. Form.C21H22ClN3O2
Mol. Mass.383.871
SMILESCC[C@H](C1CC1)n1c2nccc(-c3ccc(OC)cc3Cl)c2nc(C)c1=O