Reaction Details
TargetCorticotropin-releasing factor receptor 1
LigandBDBM50387636
Substrate/Competitorn/a
Meas. Tech.ChEMBL_830642 (CHEMBL2061535)
IC50 2±n/a nM
Citation Dzierba, CDSielecki, TMArvanitis, AGGalka, AJohnson, TLTakvorian, AGRafalski, MKasireddy-Polam, PVig, SDasgupta, BZhang, GMolski, TFWong, HZaczek, RCLodge, NJCombs, APGilligan, PJTrainor, GLBronson, JJMacor, JE Synthesis and structure-activity relationships of pyrido[3,2-b]pyrazin-3(4H)-ones and pteridin-7(8H)-ones as corticotropin-releasing factor-1 receptor antagonists. Bioorg Med Chem Lett22:4986-9 (2012) 
 
Corticotropin-releasing factor receptor 1
Name:Corticotropin-releasing factor receptor 1
Type:G Protein-Coupled Receptor (GPCR)
Mol. Mass.:47870.75
Organism:Rattus norvegicus (rat)
Description:Receptor binding assays were performed using rat cortex homogenate.
Residue:415
BDBM50387636
NameBDBM50387636
Synonyms:CHEMBL2058589
TypeSmall organic molecule
Emp. Form.C23H26ClN3O2
Mol. Mass.411.924
SMILESCCOc1cc(Cl)c(cc1C)-c1ccnc2n(C(CC)C3CC3)c(=O)c(C)nc12