Reaction Details
TargetLong-chain fatty acid transport protein 1
LigandBDBM50387683
Substrate/Competitorn/a
Meas. Tech.ChEMBL_830659 (CHEMBL2061594)
IC50 91±n/a nM
Citation Matsufuji, TIkeda, MNaito, AHirouchi, MTakakusa, HKanda, SIzumi, MHarada, JShinozuka, T Discovery and optimization of novel fatty acid transport protein 1 (FATP1) inhibitors. Bioorg Med Chem Lett22:5067-70 (2012) 
 
Long-chain fatty acid transport protein 1
Name:Long-chain fatty acid transport protein 1
Type:PROTEIN
Mol. Mass.:71289.41
Organism:Mus musculus
Description:ChEMBL_956919
Residue:646
BDBM50387683
NameBDBM50387683
Synonyms:CHEMBL2058359
TypeSmall organic molecule
Emp. Form.C20H18F3N5O2S
Mol. Mass.449.449
SMILESCCn1c(CNc2ccccc2)nnc1SCc1nc2cc(OC(F)(F)F)ccc2o1