Reaction Details
TargetLong-chain fatty acid transport protein 1
LigandBDBM50387684
Substrate/Competitorn/a
Meas. Tech.ChEMBL_830659 (CHEMBL2061594)
IC50 360±n/a nM
Citation Matsufuji, TIkeda, MNaito, AHirouchi, MTakakusa, HKanda, SIzumi, MHarada, JShinozuka, T Discovery and optimization of novel fatty acid transport protein 1 (FATP1) inhibitors. Bioorg Med Chem Lett22:5067-70 (2012) 
 
Long-chain fatty acid transport protein 1
Name:Long-chain fatty acid transport protein 1
Type:PROTEIN
Mol. Mass.:71289.41
Organism:Mus musculus
Description:ChEMBL_956919
Residue:646
BDBM50387684
NameBDBM50387684
Synonyms:CHEMBL2058358
TypeSmall organic molecule
Emp. Form.C20H18F3N5OS
Mol. Mass.433.45
SMILESCCn1c(CNc2ccccc2)nnc1SCc1nc2cc(ccc2o1)C(F)(F)F