Reaction Details
TargetMuscarinic acetylcholine receptor M1
LigandBDBM50387767
Substrate/Competitorn/a
Meas. Tech.ChEMBL_828583 (CHEMBL2060098)
IC50 370±n/a nM
Citation Melancon, BJUtley, TJSevel, CMattmann, MECheung, YYBridges, TMMorrison, RDSheffler, DJNiswender, CMDaniels, JSConn, PJLindsley, CWWood, MR Development of novel M1 antagonist scaffolds through the continued optimization of the MLPCN probe ML012. Bioorg Med Chem Lett22:5035-40 (2012) 
 
Muscarinic acetylcholine receptor M1
Name:Muscarinic acetylcholine receptor M1
Type:Protein
Mol. Mass.:51442.54
Organism:Homo sapiens (Human)
Description:P11229
Residue:460
BDBM50387767
NameBDBM50387767
Synonyms:CHEMBL2057506
TypeSmall organic molecule
Emp. Form.C18H21N5O3S
Mol. Mass.387.456
SMILESO=C(C1CN(C1)S(=O)(=O)c1cccnc1)N1CCN(CC1)c1ccncc1