Reaction Details
TargetMuscarinic acetylcholine receptor M1
LigandBDBM50387769
Substrate/Competitorn/a
Meas. Tech.ChEMBL_828583 (CHEMBL2060098)
IC50 512.86±n/a nM
Citation Melancon, BJUtley, TJSevel, CMattmann, MECheung, YYBridges, TMMorrison, RDSheffler, DJNiswender, CMDaniels, JSConn, PJLindsley, CWWood, MR Development of novel M1 antagonist scaffolds through the continued optimization of the MLPCN probe ML012. Bioorg Med Chem Lett22:5035-40 (2012) 
 
Muscarinic acetylcholine receptor M1
Name:Muscarinic acetylcholine receptor M1
Type:Protein
Mol. Mass.:51442.54
Organism:Homo sapiens (Human)
Description:P11229
Residue:460
BDBM50387769
NameBDBM50387769
Synonyms:CHEMBL2057774
TypeSmall organic molecule
Emp. Form.C23H25N5O3S
Mol. Mass.451.541
SMILESCc1cnccc1N1CCN(CC1)C(=O)C1CN(C1)S(=O)(=O)c1cccc2cnccc12