Reaction Details
TargetMuscarinic acetylcholine receptor M1
LigandBDBM50387764
Substrate/Competitorn/a
Meas. Tech.ChEMBL_828583 (CHEMBL2060098)
IC50 125.89±n/a nM
Citation Melancon, BJUtley, TJSevel, CMattmann, MECheung, YYBridges, TMMorrison, RDSheffler, DJNiswender, CMDaniels, JSConn, PJLindsley, CWWood, MR Development of novel M1 antagonist scaffolds through the continued optimization of the MLPCN probe ML012. Bioorg Med Chem Lett22:5035-40 (2012) 
 
Muscarinic acetylcholine receptor M1
Name:Muscarinic acetylcholine receptor M1
Type:Protein
Mol. Mass.:51442.54
Organism:Homo sapiens (Human)
Description:P11229
Residue:460
BDBM50387764
NameBDBM50387764
Synonyms:CHEMBL2057512
TypeSmall organic molecule
Emp. Form.C21H24N4O4S
Mol. Mass.428.505
SMILESO=C(C1CN(C1)S(=O)(=O)c1ccc2OCCc2c1)N1CCN(CC1)c1ccncc1