Reaction Details
TargetType-1 angiotensin II receptor
LigandBDBM50117910
Substrate/Competitorn/a
Meas. Tech.ChEMBL_828628 (CHEMBL2060185)
Ki 10±n/a nM
Citation Bai, RWei, ZLiu, JXie, WYao, HWu, XJiang, JWang, QXu, J Synthesis and biological evaluation of 4'-[(benzimidazole-1-yl)methyl]biphenyl-2-sulfonamide derivatives as dual angiotensin II/endothelin A receptor antagonists. Bioorg Med Chem20:4661-7 (2012) 
 
Type-1 angiotensin II receptor
Name:Type-1 angiotensin II receptor
Type:Protein
Mol. Mass.:41080.75
Organism:Homo sapiens (Human)
Description:P30556
Residue:359
BDBM50117910
NameBDBM50117910
Synonyms:4''-(2-Butyl-4-oxo-1,3-diaza-spiro[4.4]non-1-en-3-ylmethyl)-2''-(3,3-dimethyl-2-oxo-pyrrolidin-1-ylmethyl)-biphenyl-2-sulfonic acid (3,4-dimethyl-isoxazol-5-yl)-amide BMS-248360 | CHEMBL11706
TypeSmall organic molecule
Emp. Form.C36H45N5O5S
Mol. Mass.659.838
SMILESCCCCC1=NC2(CCCC2)C(=O)N1Cc1ccc(c(CN2CCC(C)(C)C2=O)c1)-c1ccccc1S(=O)(=O)Nc1onc(C)c1C