Reaction Details
TargetAlpha-2A adrenergic receptor
LigandBDBM50262235
Substrate/Competitorn/a
Meas. Tech.ChEMBL_828757 (CHEMBL2060407)
Ki 36±n/a nM
Citation Schann, SGreney, HGasparik, VDontenwill, MRascente, CLacroix, GMonassier, LBruban, VFeldman, JEhrhardt, JDBousquet, P Methylation of imidazoline related compounds leads to loss ofa2-adrenoceptor affinity. Synthesis and biological evaluation of selective I1 imidazoline receptor ligands. Bioorg Med Chem20:4710-5 (2012) 
 
Alpha-2A adrenergic receptor
Name:Alpha-2A adrenergic receptor
Type:Enzyme
Mol. Mass.:48979.91
Organism:Homo sapiens (Human)
Description:P08913
Residue:450
BDBM50262235
NameBDBM50262235
Synonyms:rilmenidine
TypeSmall organic molecule
Emp. Form.C10H17N2O
Mol. Mass.181.2542
SMILESC1CC1C(NC1=[NH+]CCO1)C1CC1