Reaction Details
TargetCannabinoid receptor 2
LigandBDBM50387883
Substrate/Competitorn/a
Meas. Tech.ChEMBL_828930 (CHEMBL2060580)
EC50 8.1±n/a nM
Citation Hollinshead, SPAstles, PCChambers, MGJohnson, MPPalmer, JTidwell, MW Discovery and optimization of novel purines as potent and selective CB2 agonists. Bioorg Med Chem Lett22:4962-6 (2012) 
 
Cannabinoid receptor 2
Name:Cannabinoid receptor 2
Type:G Protein-Coupled Receptor (GPCR)
Mol. Mass.:39690.94
Organism:Homo sapiens (Human)
Description:P34972
Residue:360
BDBM50387883
NameBDBM50387883
Synonyms:CHEMBL2057801
TypeSmall organic molecule
Emp. Form.C19H23ClN6O
Mol. Mass.386.879
SMILESCN1CCN(CC1)c1nc(C)nc2n(CCO)c(nc12)-c1ccccc1Cl