Reaction Details
TargetCannabinoid receptor 1
LigandBDBM50387880
Substrate/Competitorn/a
Meas. Tech.ChEMBL_828933 (CHEMBL2060583)
EC50>100000±n/a nM
Citation Hollinshead, SPAstles, PCChambers, MGJohnson, MPPalmer, JTidwell, MW Discovery and optimization of novel purines as potent and selective CB2 agonists. Bioorg Med Chem Lett22:4962-6 (2012) 
 
Cannabinoid receptor 1
Name:Cannabinoid receptor 1
Type:G Protein-Coupled Receptor (GPCR)
Mol. Mass.:52868.96
Organism:Homo sapiens (Human)
Description:P21554
Residue:472
BDBM50387880
NameBDBM50387880
Synonyms:CHEMBL2057797
TypeSmall organic molecule
Emp. Form.C19H20N4OS
Mol. Mass.352.453
SMILESCC(=O)N1CCN(CC1)c1nc(C)nc2sc(cc12)-c1ccccc1