Reaction Details
TargetCannabinoid receptor 1
LigandBDBM50387881
Substrate/Competitorn/a
Meas. Tech.ChEMBL_828933 (CHEMBL2060583)
EC50 1430±n/a nM
Citation Hollinshead, SPAstles, PCChambers, MGJohnson, MPPalmer, JTidwell, MW Discovery and optimization of novel purines as potent and selective CB2 agonists. Bioorg Med Chem Lett22:4962-6 (2012) 
 
Cannabinoid receptor 1
Name:Cannabinoid receptor 1
Type:G Protein-Coupled Receptor (GPCR)
Mol. Mass.:52868.96
Organism:Homo sapiens (Human)
Description:P21554
Residue:472
BDBM50387881
NameBDBM50387881
Synonyms:CHEMBL2057799
TypeSmall organic molecule
Emp. Form.C18H21ClN6
Mol. Mass.356.853
SMILESCCN1CCN(CC1)c1nc(C)nc2nc([nH]c12)-c1ccccc1Cl