Reaction Details
TargetPoly [ADP-ribose] polymerase 1
LigandBDBM50387924
Substrate/Competitorn/a
Meas. Tech.ChEMBL_830731 (CHEMBL2061718)
Ki 1.4±n/a nM
Citation Zhu, GDGong, JGandhi, VBLiu, XShi, YJohnson, EFDonawho, CKEllis, PABouska, JJOsterling, DJOlson, AMPark, CLuo, YShoemaker, AGiranda, VLPenning, TD Discovery and SAR of orally efficacious tetrahydropyridopyridazinone PARP inhibitors for the treatment of cancer. Bioorg Med Chem20:4635-45 (2012) 
 
Poly [ADP-ribose] polymerase 1
Name:Poly [ADP-ribose] polymerase 1
Type:n/a
Mol. Mass.:113114.22
Organism:Homo sapiens (Human)
Description:P09874
Residue:1014
BDBM50387924
NameBDBM50387924
Synonyms:CHEMBL2058687 | US9283222, 474
TypeSmall organic molecule
Emp. Form.C25H26FN5O3
Mol. Mass.463.504
SMILESFc1ccc(Cc2n[nH]c(=O)c3CCCNc23)cc1NC(=O)CCCC(=O)Nc1ccccc1