Reaction Details
TargetPoly [ADP-ribose] polymerase 1
LigandBDBM50387934
Substrate/Competitorn/a
Meas. Tech.ChEMBL_830731 (CHEMBL2061718)
Ki 2.5±n/a nM
Citation Zhu, GDGong, JGandhi, VBLiu, XShi, YJohnson, EFDonawho, CKEllis, PABouska, JJOsterling, DJOlson, AMPark, CLuo, YShoemaker, AGiranda, VLPenning, TD Discovery and SAR of orally efficacious tetrahydropyridopyridazinone PARP inhibitors for the treatment of cancer. Bioorg Med Chem20:4635-45 (2012) 
 
Poly [ADP-ribose] polymerase 1
Name:Poly [ADP-ribose] polymerase 1
Type:n/a
Mol. Mass.:113114.22
Organism:Homo sapiens (Human)
Description:P09874
Residue:1014
BDBM50387934
NameBDBM50387934
Synonyms:CHEMBL2058915 | US9283222, 564
TypeSmall organic molecule
Emp. Form.C24H30FN5O2
Mol. Mass.439.5257
SMILESFc1ccc(Cc2n[nH]c(=O)c3CCCNc23)cc1C(=O)N1CCN(CC1)C1CCCC1