Reaction Details
TargetPoly [ADP-ribose] polymerase 1
LigandBDBM50387935
Substrate/Competitorn/a
Meas. Tech.ChEMBL_830731 (CHEMBL2061718)
Ki 0.9±n/a nM
Citation Zhu, GDGong, JGandhi, VBLiu, XShi, YJohnson, EFDonawho, CKEllis, PABouska, JJOsterling, DJOlson, AMPark, CLuo, YShoemaker, AGiranda, VLPenning, TD Discovery and SAR of orally efficacious tetrahydropyridopyridazinone PARP inhibitors for the treatment of cancer. Bioorg Med Chem20:4635-45 (2012) 
 
Poly [ADP-ribose] polymerase 1
Name:Poly [ADP-ribose] polymerase 1
Type:n/a
Mol. Mass.:113114.22
Organism:Homo sapiens (Human)
Description:P09874
Residue:1014
BDBM50387935
NameBDBM50387935
Synonyms:CHEMBL2058916 | US9283222, 607
TypeSmall organic molecule
Emp. Form.C19H20FN5O3
Mol. Mass.385.3922
SMILESFc1ccc(Cc2n[nH]c(=O)c3CCCNc23)cc1C(=O)N1CCNC(=O)C1