Reaction Details
TargetPoly [ADP-ribose] polymerase 1
LigandBDBM50387937
Substrate/Competitorn/a
Meas. Tech.ChEMBL_830731 (CHEMBL2061718)
Ki 1.3±n/a nM
Citation Zhu, GDGong, JGandhi, VBLiu, XShi, YJohnson, EFDonawho, CKEllis, PABouska, JJOsterling, DJOlson, AMPark, CLuo, YShoemaker, AGiranda, VLPenning, TD Discovery and SAR of orally efficacious tetrahydropyridopyridazinone PARP inhibitors for the treatment of cancer. Bioorg Med Chem20:4635-45 (2012) 
 
Poly [ADP-ribose] polymerase 1
Name:Poly [ADP-ribose] polymerase 1
Type:n/a
Mol. Mass.:113114.22
Organism:Homo sapiens (Human)
Description:P09874
Residue:1014
BDBM50387937
NameBDBM50387937
Synonyms:CHEMBL2058918 | US9283222, 559
TypeSmall organic molecule
Emp. Form.C21H24FN5O3
Mol. Mass.413.4454
SMILESCC(=O)N1CCN(CC1)C(=O)c1cc(Cc2n[nH]c(=O)c3CCCNc23)ccc1F