Reaction Details
TargetPoly [ADP-ribose] polymerase 1
LigandBDBM50387918
Substrate/Competitorn/a
Meas. Tech.ChEMBL_830732 (CHEMBL2061719)
EC50 22±n/a nM
Citation Zhu, GDGong, JGandhi, VBLiu, XShi, YJohnson, EFDonawho, CKEllis, PABouska, JJOsterling, DJOlson, AMPark, CLuo, YShoemaker, AGiranda, VLPenning, TD Discovery and SAR of orally efficacious tetrahydropyridopyridazinone PARP inhibitors for the treatment of cancer. Bioorg Med Chem20:4635-45 (2012) 
 
Poly [ADP-ribose] polymerase 1
Name:Poly [ADP-ribose] polymerase 1
Type:n/a
Mol. Mass.:113114.22
Organism:Homo sapiens (Human)
Description:P09874
Residue:1014
BDBM50387918
NameBDBM50387918
Synonyms:CHEMBL2058680 | US9283222, 459
TypeSmall organic molecule
Emp. Form.C17H17FN4O2
Mol. Mass.328.3409
SMILESFc1ccc(Cc2n[nH]c(=O)c3CCCNc23)cc1N1CCC1=O