Reaction Details
TargetPoly [ADP-ribose] polymerase 1
LigandBDBM50387929
Substrate/Competitorn/a
Meas. Tech.ChEMBL_830732 (CHEMBL2061719)
EC50 290±n/a nM
Citation Zhu, GDGong, JGandhi, VBLiu, XShi, YJohnson, EFDonawho, CKEllis, PABouska, JJOsterling, DJOlson, AMPark, CLuo, YShoemaker, AGiranda, VLPenning, TD Discovery and SAR of orally efficacious tetrahydropyridopyridazinone PARP inhibitors for the treatment of cancer. Bioorg Med Chem20:4635-45 (2012) 
 
Poly [ADP-ribose] polymerase 1
Name:Poly [ADP-ribose] polymerase 1
Type:n/a
Mol. Mass.:113114.22
Organism:Homo sapiens (Human)
Description:P09874
Residue:1014
BDBM50387929
NameBDBM50387929
Synonyms:CHEMBL2058693 | US9283222, 563
TypeSmall organic molecule
Emp. Form.C22H29FN6O2
Mol. Mass.428.5031
SMILESCN1CCN(CCNC(=O)c2cc(Cc3n[nH]c(=O)c4CCCNc34)ccc2F)CC1