Reaction Details
TargetHistone deacetylase 1
LigandBDBM50387966
Substrate/Competitorn/a
Meas. Tech.ChEMBL_829144 (CHEMBL2059966)
IC50 3800±n/a nM
Citation Vaidya, ASKarumudi, BMendonca, EMadriaga, AAbdelkarim, Hvan Breemen, RBPetukhov, PA Design, synthesis, modeling, biological evaluation and photoaffinity labeling studies of novel series of photoreactive benzamide probes for histone deacetylase 2. Bioorg Med Chem Lett22:5025-30 (2012) 
 
Histone deacetylase 1
Name:Histone deacetylase 1
Type:Enzyme
Mol. Mass.:55090.27
Organism:Homo sapiens (Human)
Description:Q13547
Residue:482
BDBM50387966
NameBDBM50387966
Synonyms:CHEMBL2057820
TypeSmall organic molecule
Emp. Form.C28H24N6O3
Mol. Mass.492.5286
SMILESNc1ccc(cc1NC(=O)c1ccc(CNC(=O)OCc2cccc(c2)N=[N+]=[N-])cc1)-c1ccccc1