Reaction Details
TargetHistone deacetylase 1
LigandBDBM50387964
Substrate/Competitorn/a
Meas. Tech.ChEMBL_829145 (CHEMBL2059967)
IC50 990±n/a nM
Citation Vaidya, ASKarumudi, BMendonca, EMadriaga, AAbdelkarim, Hvan Breemen, RBPetukhov, PA Design, synthesis, modeling, biological evaluation and photoaffinity labeling studies of novel series of photoreactive benzamide probes for histone deacetylase 2. Bioorg Med Chem Lett22:5025-30 (2012) 
 
Histone deacetylase 1
Name:Histone deacetylase 1
Type:Enzyme
Mol. Mass.:55090.27
Organism:Homo sapiens (Human)
Description:Q13547
Residue:482
BDBM50387964
NameBDBM50387964
Synonyms:CHEMBL2057821
TypeSmall organic molecule
Emp. Form.C29H25N9O3
Mol. Mass.547.5673
SMILESNc1ccc(cc1NC(=O)c1ccc(CNC(=O)OCc2cc(CN=[N+]=[N-])cc(c2)N=[N+]=[N-])cc1)-c1ccccc1