Reaction Details
TargetHistone deacetylase 2
LigandBDBM50387967
Substrate/Competitorn/a
Meas. Tech.ChEMBL_829146 (CHEMBL2059968)
IC50 5130±n/a nM
Citation Vaidya, ASKarumudi, BMendonca, EMadriaga, AAbdelkarim, Hvan Breemen, RBPetukhov, PA Design, synthesis, modeling, biological evaluation and photoaffinity labeling studies of novel series of photoreactive benzamide probes for histone deacetylase 2. Bioorg Med Chem Lett22:5025-30 (2012) 
 
Histone deacetylase 2
Name:Histone deacetylase 2
Type:Chromatin regulator; hydrolase; repressor
Mol. Mass.:55356.54
Organism:Homo sapiens (Human)
Description:Q92769
Residue:488
BDBM50387967
NameBDBM50387967
Synonyms:CHEMBL2057823
TypeSmall organic molecule
Emp. Form.C19H15N5O
Mol. Mass.329.3553
SMILESNc1ccc(cc1NC(=O)c1ccc(cc1)N=[N+]=[N-])-c1ccccc1