Reaction Details
TargetHistone deacetylase 2
LigandBDBM19149
Substrate/Competitorn/a
Meas. Tech.ChEMBL_829146 (CHEMBL2059968)
IC50 200±n/a nM
Citation Vaidya, ASKarumudi, BMendonca, EMadriaga, AAbdelkarim, Hvan Breemen, RBPetukhov, PA Design, synthesis, modeling, biological evaluation and photoaffinity labeling studies of novel series of photoreactive benzamide probes for histone deacetylase 2. Bioorg Med Chem Lett22:5025-30 (2012) 
 
Histone deacetylase 2
Name:Histone deacetylase 2
Type:Chromatin regulator; hydrolase; repressor
Mol. Mass.:55356.54
Organism:Homo sapiens (Human)
Description:Q92769
Residue:488
BDBM19149
NameBDBM19149
Synonyms:CHEMBL98 SAHA US10188756, Compound SAHA US11505523, Compound SAHA US9353061, SAHA US9695181, Vorinostat Zolinza suberoylanilide hydroxamic acid
TypeSmall organic molecule
Emp. Form.C14H20N2O3
Mol. Mass.264.3202
SMILESONC(=O)CCCCCCC(=O)Nc1ccccc1