Reaction Details
TargetHistone deacetylase 2
LigandBDBM50229191
Substrate/Competitorn/a
Meas. Tech.ChEMBL_829147 (CHEMBL2059969)
IC50 14000±n/a nM
Citation Vaidya, ASKarumudi, BMendonca, EMadriaga, AAbdelkarim, Hvan Breemen, RBPetukhov, PA Design, synthesis, modeling, biological evaluation and photoaffinity labeling studies of novel series of photoreactive benzamide probes for histone deacetylase 2. Bioorg Med Chem Lett22:5025-30 (2012) 
 
Histone deacetylase 2
Name:Histone deacetylase 2
Type:Chromatin regulator; hydrolase; repressor
Mol. Mass.:55356.54
Organism:Homo sapiens (Human)
Description:Q92769
Residue:488
BDBM50229191
NameBDBM50229191
Synonyms:CHEMBL252409 [4-(4-amino-biphenyl-3-ylcarbamoyl)-benzyl]-carbamic acid benzyl ester
TypeSmall organic molecule
Emp. Form.C28H25N3O3
Mol. Mass.451.5164
SMILESNc1ccc(cc1NC(=O)c1ccc(CNC(=O)OCc2ccccc2)cc1)-c1ccccc1