Reaction Details
TargetHistone deacetylase 2
LigandBDBM50387965
Substrate/Competitorn/a
Meas. Tech.ChEMBL_829147 (CHEMBL2059969)
IC50 690±n/a nM
Citation Vaidya, ASKarumudi, BMendonca, EMadriaga, AAbdelkarim, Hvan Breemen, RBPetukhov, PA Design, synthesis, modeling, biological evaluation and photoaffinity labeling studies of novel series of photoreactive benzamide probes for histone deacetylase 2. Bioorg Med Chem Lett22:5025-30 (2012) 
 
Histone deacetylase 2
Name:Histone deacetylase 2
Type:Chromatin regulator; hydrolase; repressor
Mol. Mass.:55356.54
Organism:Homo sapiens (Human)
Description:Q92769
Residue:488
BDBM50387965
NameBDBM50387965
Synonyms:CHEMBL2057824
TypeSmall organic molecule
Emp. Form.C17H13N5OS
Mol. Mass.335.383
SMILESNc1ccc(cc1NC(=O)c1ccc(cc1)N=[N+]=[N-])-c1cccs1