Reaction Details
TargetHistone deacetylase 2
LigandBDBM50387964
Substrate/Competitorn/a
Meas. Tech.ChEMBL_829147 (CHEMBL2059969)
IC50 1100±n/a nM
Citation Vaidya, ASKarumudi, BMendonca, EMadriaga, AAbdelkarim, Hvan Breemen, RBPetukhov, PA Design, synthesis, modeling, biological evaluation and photoaffinity labeling studies of novel series of photoreactive benzamide probes for histone deacetylase 2. Bioorg Med Chem Lett22:5025-30 (2012) 
 
Histone deacetylase 2
Name:Histone deacetylase 2
Type:Chromatin regulator; hydrolase; repressor
Mol. Mass.:55356.54
Organism:Homo sapiens (Human)
Description:Q92769
Residue:488
BDBM50387964
NameBDBM50387964
Synonyms:CHEMBL2057821
TypeSmall organic molecule
Emp. Form.C29H25N9O3
Mol. Mass.547.5673
SMILESNc1ccc(cc1NC(=O)c1ccc(CNC(=O)OCc2cc(CN=[N+]=[N-])cc(c2)N=[N+]=[N-])cc1)-c1ccccc1