Reaction Details
TargetHistone deacetylase 2
LigandBDBM50387969
Substrate/Competitorn/a
Meas. Tech.ChEMBL_829148 (CHEMBL2059970)
IC50 10000±n/a nM
Citation Vaidya, ASKarumudi, BMendonca, EMadriaga, AAbdelkarim, Hvan Breemen, RBPetukhov, PA Design, synthesis, modeling, biological evaluation and photoaffinity labeling studies of novel series of photoreactive benzamide probes for histone deacetylase 2. Bioorg Med Chem Lett22:5025-30 (2012) 
 
Histone deacetylase 2
Name:Histone deacetylase 2
Type:Chromatin regulator; hydrolase; repressor
Mol. Mass.:55356.54
Organism:Homo sapiens (Human)
Description:Q92769
Residue:488
BDBM50387969
NameBDBM50387969
Synonyms:CHEMBL2057826
TypeSmall organic molecule
Emp. Form.C20H16N8O
Mol. Mass.384.394
SMILESNc1ccc(cc1NC(=O)c1cc(CN=[N+]=[N-])cc(c1)N=[N+]=[N-])-c1ccccc1