Reaction Details
TargetPhosphoethanolamine N-methyltransferase
LigandBDBM50149893
Substrate/Competitorn/a
Meas. Tech.ChEMBL_829173 (CHEMBL2059995)
IC50 460000±n/a nM
Citation Lee, SGAlpert, TDJez, JM Crystal structure of phosphoethanolamine methyltransferase from Plasmodium falciparum in complex with amodiaquine. Bioorg Med Chem Lett22:4990-3 (2012) 
 
Phosphoethanolamine N-methyltransferase
Name:Phosphoethanolamine N-methyltransferase
Synonyms:PMT
Type:PROTEIN
Mol. Mass.:31038.21
Organism:Plasmodium falciparum
Description:ChEMBL_829173
Residue:266
BDBM50149893
NameBDBM50149893
TypeSmall organic molecule
Emp. Form.C15H22N3O
Mol. Mass.260.3541
SMILESCOc1cc(NC(C)CCC[NH3+])c2ncccc2c1