Reaction Details
TargetAmine oxidase [flavin-containing] B
LigandBDBM50387995
Substrate/Competitorn/a
Meas. Tech.ChEMBL_829594 (CHEMBL2060937)
IC50 450±n/a nM
Citation Lewellyn, KBialonska, DChaurasiya, NDTekwani, BLZjawiony, JK Synthesis and evaluation of aplysinopsin analogs as inhibitors of human monoamine oxidase A and B. Bioorg Med Chem Lett22:4926-9 (2012) 
 
Amine oxidase [flavin-containing] B
Name:Amine oxidase [flavin-containing] B
Type:Protein
Mol. Mass.:58768.76
Organism:Homo sapiens (Human)
Description:P27338
Residue:520
BDBM50387995
NameBDBM50387995
Synonyms:CHEMBL2058694
TypeSmall organic molecule
Emp. Form.C12H8BrN3OS
Mol. Mass.322.18
SMILESBrc1cccc2[nH]cc(\C=C3/NC(=S)NC3=O)c12