Reaction Details
TargetAmine oxidase [flavin-containing] A
LigandBDBM50388006
Substrate/Competitorn/a
Meas. Tech.ChEMBL_829593 (CHEMBL2060936)
IC50 18±n/a nM
Citation Lewellyn, KBialonska, DChaurasiya, NDTekwani, BLZjawiony, JK Synthesis and evaluation of aplysinopsin analogs as inhibitors of human monoamine oxidase A and B. Bioorg Med Chem Lett22:4926-9 (2012) 
 
Amine oxidase [flavin-containing] A
Name:Amine oxidase [flavin-containing] A
Type:Protein
Mol. Mass.:59689.53
Organism:Homo sapiens (Human)
Description:P21397
Residue:527
BDBM50388006
NameBDBM50388006
Synonyms:CHEMBL2058428
TypeSmall organic molecule
Emp. Form.C15H15BrN4O
Mol. Mass.347.21
SMILESC\N=C1/N(C)C(=O)\C(=C/c2c[nH]c3cc(Br)ccc23)N1C