Reaction Details
TargetAmine oxidase [flavin-containing] A
LigandBDBM50387996
Substrate/Competitorn/a
Meas. Tech.ChEMBL_829593 (CHEMBL2060936)
IC50 1080±n/a nM
Citation Lewellyn, KBialonska, DChaurasiya, NDTekwani, BLZjawiony, JK Synthesis and evaluation of aplysinopsin analogs as inhibitors of human monoamine oxidase A and B. Bioorg Med Chem Lett22:4926-9 (2012) 
 
Amine oxidase [flavin-containing] A
Name:Amine oxidase [flavin-containing] A
Type:Protein
Mol. Mass.:59689.53
Organism:Homo sapiens (Human)
Description:P21397
Residue:527
BDBM50387996
NameBDBM50387996
Synonyms:CHEMBL2058425
TypeSmall organic molecule
Emp. Form.C14H13BrN4O
Mol. Mass.333.183
SMILESCNC1=NC(=Cc2c[nH]c3c(Br)cccc23)C(=O)N1C