Reaction Details
TargetAmine oxidase [flavin-containing] A
LigandBDBM50250840
Substrate/Competitorn/a
Meas. Tech.ChEMBL_829593 (CHEMBL2060936)
IC50 5.6±n/a nM
Citation Lewellyn, KBialonska, DChaurasiya, NDTekwani, BLZjawiony, JK Synthesis and evaluation of aplysinopsin analogs as inhibitors of human monoamine oxidase A and B. Bioorg Med Chem Lett22:4926-9 (2012) 
 
Amine oxidase [flavin-containing] A
Name:Amine oxidase [flavin-containing] A
Type:Protein
Mol. Mass.:59689.53
Organism:Homo sapiens (Human)
Description:P21397
Residue:527
BDBM50250840
NameBDBM50250840
Synonyms:5-(6-Bromo-1H-indol-3-ylmethylene)-2-imino-1,3-dimethyl-imidazolidin-4-one CHEMBL463249
TypeSmall organic molecule
Emp. Form.C14H13BrN4O
Mol. Mass.333.183
SMILESCN1C(=N)N(C)\C(=C\c2c[nH]c3cc(Br)ccc23)C1=O