Reaction Details
TargetTransient receptor potential cation channel subfamily V member 1
LigandBDBM50082242
Substrate/Competitorn/a
Meas. Tech.ChEMBL_830095 (CHEMBL2061886)
Ki 930±n/a nM
Citation Cho, YKim, MSKim, HSAnn, JLee, JPearce, LVPavlyukovets, VAMorgan, MABlumberg, PMLee, J The SAR analysis of TRPV1 agonists with thea-methylated B-region. Bioorg Med Chem Lett22:5227-31 (2012) 
 
Transient receptor potential cation channel subfamily V member 1
Name:Transient receptor potential cation channel subfamily V member 1
Type:Transient Receptor
Mol. Mass.:94956.12
Organism:Rattus norvegicus (rat)
Description:O35433
Residue:838
BDBM50082242
NameBDBM50082242
Synonyms:2-[4-(2-Amino-ethoxy)-3-methoxy-phenyl]-N-[3-(3,4-dimethyl-phenyl)-propyl]-acetamide | CHEMBL328628
TypeSmall organic molecule
Emp. Form.C22H30N2O3
Mol. Mass.370.4852
SMILESCOc1cc(CC(=O)NCCCc2ccc(C)c(C)c2)ccc1OCCN