Reaction Details
TargetLysophosphatidic acid receptor 5
LigandBDBM50373826
Substrate/Competitorn/a
Meas. Tech.ChEMBL_830365 (CHEMBL2060999)
IC50>30000±n/a nM
Citation Kozian, DHEvers, AFlorian, PWonerow, PJoho, SNazare, M Selective non-lipid modulator of LPA5 activity in human platelets. Bioorg Med Chem Lett22:5239-43 (2012) 
 
Lysophosphatidic acid receptor 5
Name:Lysophosphatidic acid receptor 5
Type:Enzyme
Mol. Mass.:41372.36
Organism:Homo sapiens (Human)
Description:Q9H1C0
Residue:372
BDBM50373826
NameBDBM50373826
Synonyms:CHEMBL256470
TypeSmall organic molecule
Emp. Form.C20H23Cl2N5O2S2
Mol. Mass.500.465
SMILESC[C@@H](CN1CCN(CC1)S(=O)(=O)c1ccc(Cl)c(Cl)c1)Nc1ncnc2c(C)csc12