Reaction Details
TargetDNA gyrase subunit B
LigandBDBM50388101
Substrate/Competitorn/a
Meas. Tech.ChEMBL_830517 (CHEMBL2061329)
IC50 2±n/a nM
Citation Manchester, JIDussault, DDRose, JABoriack-Sjodin, PAUria-Nickelsen, MIoannidis, GBist, SFleming, PHull, KG Discovery of a novel azaindole class of antibacterial agents targeting the ATPase domains of DNA gyrase and Topoisomerase IV. Bioorg Med Chem Lett22:5150-6 (2012) 
 
DNA gyrase subunit B
Name:DNA gyrase subunit B
Type:Enzyme Subunit
Mol. Mass.:72530.91
Organism:Staphylococcus aureus
Description:n/a
Residue:644
BDBM50388101
NameBDBM50388101
Synonyms:CHEMBL2059380
TypeSmall organic molecule
Emp. Form.C22H17F3N8O4
Mol. Mass.514.4168
SMILESCCNC(=O)c1cc2c(c(cnc2[nH]1)-c1cc(cnc1OC)-c1n[nH]c(=O)o1)-n1ccc(n1)C(F)(F)F