Reaction Details
TargetDipeptidyl peptidase 8
LigandBDBM50206038
Substrate/Competitorn/a
Meas. Tech.ChEMBL_829357 (CHEMBL2060148)
IC50 12.2±n/a nM
Citation Yoshida, TAkahoshi, FSakashita, HSonda, STakeuchi, MTanaka, YNabeno, MKishida, HMiyaguchi, IHayashi, Y Fused bicyclic heteroarylpiperazine-substituted L-prolylthiazolidines as highly potent DPP-4 inhibitors lacking the electrophilic nitrile group. Bioorg Med Chem20:5033-41 (2012) 
 
Dipeptidyl peptidase 8
Name:Dipeptidyl peptidase 8
Type:Enzyme
Mol. Mass.:103342.62
Organism:Homo sapiens (Human)
Description:Q6V1X1
Residue:898
BDBM50206038
NameBDBM50206038
Synonyms:((2S,4S)-4-(4-(4-nitrophenyl)piperazin-1-yl)pyrrolidin-2-yl)(thiazolidin-3-yl)methanone | CHEMBL391466
TypeSmall organic molecule
Emp. Form.C18H25N5O3S
Mol. Mass.391.488
SMILES[O-][N+](=O)c1ccc(cc1)N1CCN(CC1)[C@@H]1CN[C@@H](C1)C(=O)N1CCSC1