Reaction Details
TargetEndochitinase B1
LigandBDBM81508
Substrate/Competitorn/a
Meas. Tech.ChEMBL_828634 (CHEMBL2060191)
IC50 200±n/a nM
Citation Schüttelkopf, AWAndersen, OARao, FVAllwood, MRush, CLEggleston, IMvan Aalten, DM Bisdionin C-a rationally designed, submicromolar inhibitor of family 18 chitinases. ACS Med Chem Lett2:428-432 (2011) 
 
Endochitinase B1
Name:Endochitinase B1
Type:Enzyme
Mol. Mass.:47612.97
Organism:Aspergillus fumigatus
Description:Q873X9
Residue:433
BDBM81508
NameBDBM81508
Synonyms:Bisdionin C
TypeSmall organic molecule
Emp. Form.C17H20N8O4
Mol. Mass.400.3919
SMILESCn1cnc2n(C)c(=O)n(CCCn3c(=O)n(C)c4ncn(C)c4c3=O)c(=O)c12