Reaction Details
TargetPeptidyl-prolyl cis-trans isomerase FKBP4
LigandBDBM50132556
Substrate/Competitorn/a
Meas. Tech.ChEMBL_829711 (CHEMBL2061151)
IC50 10500±n/a nM
Citation Gopalakrishnan, RKozany, CGaali, SKress, CHoogeland, BBracher, AHausch, F Evaluation of synthetic FK506 analogues as ligands for the FK506-binding proteins 51 and 52. J Med Chem55:4114-22 (2012) 
 
Peptidyl-prolyl cis-trans isomerase FKBP4
Name:Peptidyl-prolyl cis-trans isomerase FKBP4
Type:PROTEIN
Mol. Mass.:51793.87
Organism:Homo sapiens (Human)
Description:ChEMBL_154482
Residue:459
BDBM50132556
NameBDBM50132556
Synonyms:(S)-1-(3,3-Dimethyl-2-oxo-pentanoyl)-piperidine-2-carboxylic acid (R)-1-(3-carboxymethoxy-phenyl)-3-(3,4-dimethoxy-phenyl)-propyl ester | CHEMBL321022
TypeSmall organic molecule
Emp. Form.C32H41NO9
Mol. Mass.583.6692
SMILESCCC(C)(C)C(=O)C(=O)N1CCCC[C@H]1C(=O)O[C@H](CCc1ccc(OC)c(OC)c1)c1cccc(OCC(O)=O)c1