Reaction Details
TargetPeptidyl-prolyl cis-trans isomerase FKBP4
LigandBDBM50109811
Substrate/Competitorn/a
Meas. Tech.ChEMBL_829711 (CHEMBL2061151)
IC50 7370±n/a nM
Citation Gopalakrishnan, RKozany, CGaali, SKress, CHoogeland, BBracher, AHausch, F Evaluation of synthetic FK506 analogues as ligands for the FK506-binding proteins 51 and 52. J Med Chem55:4114-22 (2012) 
 
Peptidyl-prolyl cis-trans isomerase FKBP4
Name:Peptidyl-prolyl cis-trans isomerase FKBP4
Type:PROTEIN
Mol. Mass.:51793.87
Organism:Homo sapiens (Human)
Description:ChEMBL_154482
Residue:459
BDBM50109811
NameBDBM50109811
Synonyms:(S)-1-[2-Oxo-2-(3,4,5-trimethoxy-phenyl)-acetyl]-piperidine-2-carboxylic acid 4-pyridin-3-yl-1-(3-pyridin-3-yl-propyl)-butyl ester CHEMBL350775
TypeSmall organic molecule
Emp. Form.C34H41N3O7
Mol. Mass.603.7052
SMILESCOc1cc(cc(OC)c1OC)C(=O)C(=O)N1CCCC[C@H]1C(=O)OC(CCCc1cccnc1)CCCc1cccnc1