Reaction Details
TargetPeptidyl-prolyl cis-trans isomerase FKBP4
LigandBDBM50388314
Substrate/Competitorn/a
Meas. Tech.ChEMBL_829711 (CHEMBL2061151)
IC50 2130±n/a nM
Citation Gopalakrishnan, RKozany, CGaali, SKress, CHoogeland, BBracher, AHausch, F Evaluation of synthetic FK506 analogues as ligands for the FK506-binding proteins 51 and 52. J Med Chem55:4114-22 (2012) 
 
Peptidyl-prolyl cis-trans isomerase FKBP4
Name:Peptidyl-prolyl cis-trans isomerase FKBP4
Type:PROTEIN
Mol. Mass.:51793.87
Organism:Homo sapiens (Human)
Description:ChEMBL_154482
Residue:459
BDBM50388314
NameBDBM50388314
Synonyms:CHEMBL2059029
TypeSmall organic molecule
Emp. Form.C34H43NO10
Mol. Mass.625.7059
SMILESCOc1ccc(CC[C@@H](OC(=O)[C@@H]2CCCCN2C(=O)C(=O)[C@]2(O)CCCC[C@H]2C)c2cccc(OCC(O)=O)c2)cc1OC