Reaction Details
TargetHeparanase
LigandBDBM50388338
Substrate/Competitorn/a
Meas. Tech.ChEMBL_829715 (CHEMBL2061155)
Ki 111±n/a nM
Citation Ferro, VLiu, LJohnstone, KDWimmer, NKaroli, THandley, PRowley, JDredge, KLi, CPHammond, EDavis, KSarimaa, LHarenberg, JBytheway, I Discovery of PG545: a highly potent and simultaneous inhibitor of angiogenesis, tumor growth, and metastasis. J Med Chem55:3804-13 (2012) 
 
Heparanase
Name:Heparanase
Type:PROTEIN
Mol. Mass.:61167.67
Organism:Homo sapiens (Human)
Description:ChEMBL_327900
Residue:543
BDBM50388338
NameBDBM50388338
Synonyms:CHEMBL2059508
TypeSmall organic molecule
Emp. Form.C33H54O18S4
Mol. Mass.867.033
SMILESCC(C)CCC[C@@H](C)[C@H]1CC[C@H]2[C@@H]3CC[C@H]4C[C@H](CC[C@]4(C)[C@H]3CC[C@]12C)O[C@H]1O[C@H](COS([O-])(=O)=O)[C@@H](OS([O-])(=O)=O)[C@H](OS([O-])(=O)=O)[C@@H]1OS([O-])(=O)=O