Reaction Details
TargetSolute carrier family 2, facilitated glucose transporter member 1
LigandBDBM50388392
Substrate/Competitorn/a
Meas. Tech.ChEMBL_829819 (CHEMBL2061377)
IC50 2000±n/a nM
Citation Wang, DChu, PCYang, CNYan, RChuang, YCKulp, SKChen, CS Development of a novel class of glucose transporter inhibitors. J Med Chem55:3827-36 (2012) 
 
Solute carrier family 2, facilitated glucose transporter member 1
Name:Solute carrier family 2, facilitated glucose transporter member 1
Type:Protein
Mol. Mass.:54091.71
Organism:Homo sapiens (Human)
Description:n/a
Residue:492
BDBM50388392
NameBDBM50388392
Synonyms:CHEMBL2058262
TypeSmall organic molecule
Emp. Form.C18H14F9NO3S
Mol. Mass.495.359
SMILESCC(CN1C(=O)S\C(=C/c2ccc(O)c(c2)C(F)(F)F)C1=O)(CC(F)(F)F)CC(F)(F)F