Reaction Details
TargetVitamin D3 receptor
LigandBDBM50388438
Substrate/Competitorn/a
Meas. Tech.ChEMBL_829921 (CHEMBL2061569)
Ki 0.06±n/a nM
Citation Flores, ASicinski, RRGrzywacz, PThoden, JBPlum, LAClagett-Dame, MDeLuca, HF A 20S combined with a 22R configuration markedly increases both in vivo and in vitro biological activity of 1a,25-dihydroxy-22-methyl-2-methylene-19-norvitamin D3. J Med Chem55:4352-66 (2012) 
 
Vitamin D3 receptor
Name:Vitamin D3 receptor
Type:PROTEIN
Mol. Mass.:47811.07
Organism:Rattus norvegicus
Description:ChEMBL_1505946
Residue:423
BDBM50388438
NameBDBM50388438
Synonyms:CHEMBL2059271
TypeSmall organic molecule
Emp. Form.C29H48O3
Mol. Mass.444.6896
SMILES[#6]-[#6@H](-[#6@H]1-[#6]-[#6]-[#6@H]2\[#6](-[#6]-[#6]-[#6][C@]12[#6])=[#6]\[#6]=[#6]-1/[#6]-[#6@@H](-[#8])-[#6](=[#6])-[#6@H](-[#8])-[#6]-1)C([#6])([#6])[#6]-[#6]C([#6])([#6])[#8]