Reaction Details
TargetMelanin-concentrating hormone receptor 1
LigandBDBM50388452
Substrate/Competitorn/a
Meas. Tech.ChEMBL_829934 (CHEMBL2061639)
IC50 1.9±n/a nM
Citation Kasai, SKamata, MMasada, SKunitomo, JKamaura, MOkawa, TTakami, KOgino, HNakano, YAshina, SWatanabe, KKaisho, TImai, YNRyu, SNakayama, MNagisa, YTakekawa, SKato, KMurata, TSuzuki, NIshihara, Y Synthesis, structure-activity relationship, and pharmacological studies of novel melanin-concentrating hormone receptor 1 antagonists 3-aminomethylquinolines: reducing human ether-a-go-go-related gene (hERG) associated liabilities. J Med Chem55:4336-51 (2012) 
 
Melanin-concentrating hormone receptor 1
Name:Melanin-concentrating hormone receptor 1
Type:Enzyme Catalytic Domain
Mol. Mass.:39075.64
Organism:RAT
Description:Melanin Concentrating Hormone 1 GPR24 RAT::P97639
Residue:353
BDBM50388452
NameBDBM50388452
Synonyms:CHEMBL2059420
TypeSmall organic molecule
Emp. Form.C27H31N3O2
Mol. Mass.429.5539
SMILESC[C@@H](N1CCCC1)c1cnc2c(C)c(NC(=O)c3ccc(OCC4CC4)cc3)ccc2c1