Reaction Details
TargetMelanin-concentrating hormone receptor 1
LigandBDBM50388443
Substrate/Competitorn/a
Meas. Tech.ChEMBL_829933 (CHEMBL2061638)
IC50 1.8±n/a nM
Citation Kasai, SKamata, MMasada, SKunitomo, JKamaura, MOkawa, TTakami, KOgino, HNakano, YAshina, SWatanabe, KKaisho, TImai, YNRyu, SNakayama, MNagisa, YTakekawa, SKato, KMurata, TSuzuki, NIshihara, Y Synthesis, structure-activity relationship, and pharmacological studies of novel melanin-concentrating hormone receptor 1 antagonists 3-aminomethylquinolines: reducing human ether-a-go-go-related gene (hERG) associated liabilities. J Med Chem55:4336-51 (2012) 
 
Melanin-concentrating hormone receptor 1
Name:Melanin-concentrating hormone receptor 1
Type:G Protein-Coupled Receptor (GPCR)
Mol. Mass.:45976.27
Organism:Homo sapiens (Human)
Description:Membranes from CHO-K1 cells stably expressing human MCH1R were used in assays.
Residue:422
BDBM50388443
NameBDBM50388443
Synonyms:CHEMBL2059409
TypeSmall organic molecule
Emp. Form.C26H29N3O2
Mol. Mass.415.5274
SMILESCc1c(NC(=O)c2ccc(OCC3CC3)cc2)ccc2cc(CN3CCCC3)cnc12