Reaction Details
TargetCytochrome P450 3A4
LigandBDBM50388469
Substrate/Competitorn/a
Meas. Tech.ChEMBL_829955 (CHEMBL2061660)
IC50>10000±n/a nM
Citation Ren, FDeng, GWang, HLuan, LMeng, QXu, QXu, HXu, XZhang, HZhao, BLi, CGuo, TBYang, JZhang, WZhao, YJia, QLu, HXiang, JNElliott, JDLin, X Discovery of novel 1,2,4-thiadiazole derivatives as potent, orally active agonists of sphingosine 1-phosphate receptor subtype 1 (S1P(1)). J Med Chem55:4286-96 (2012) 
 
Cytochrome P450 3A4
Name:Cytochrome P450 3A4
Type:Enzyme
Mol. Mass.:57349.57
Organism:Homo sapiens (Human)
Description:n/a
Residue:503
BDBM50388469
NameBDBM50388469
Synonyms:CHEMBL2059516
TypeSmall organic molecule
Emp. Form.C24H25N3O3S
Mol. Mass.435.539
SMILESCCc1c(CCCC(O)=O)cccc1-c1nnc(s1)-c1ccc(OC(C)C)c(c1)C#N