Reaction Details
TargetCytochrome P450 2C19
LigandBDBM50388471
Substrate/Competitorn/a
Meas. Tech.ChEMBL_829953 (CHEMBL2061658)
IC50>10000±n/a nM
Citation Ren, FDeng, GWang, HLuan, LMeng, QXu, QXu, HXu, XZhang, HZhao, BLi, CGuo, TBYang, JZhang, WZhao, YJia, QLu, HXiang, JNElliott, JDLin, X Discovery of novel 1,2,4-thiadiazole derivatives as potent, orally active agonists of sphingosine 1-phosphate receptor subtype 1 (S1P(1)). J Med Chem55:4286-96 (2012) 
 
Cytochrome P450 2C19
Name:Cytochrome P450 2C19
Type:Enzyme
Mol. Mass.:55935.47
Organism:Homo sapiens (Human)
Description:P33261
Residue:490
BDBM50388471
NameBDBM50388471
Synonyms:CHEMBL2057282
TypeSmall organic molecule
Emp. Form.C27H32ClN3O3S
Mol. Mass.514.079
SMILESCCc1c(CCN2CCC(CC2)C(O)=O)cccc1-c1nsc(n1)-c1ccc(OC(C)C)c(Cl)c1